enclos funéraire
created: 2011-09-01T00:00:00+02:00
modified: 2014-10-20T11:33:18+02:00
status: 1
type: Concept
broader: T96-160
definition: Enclos, généralement privé, utilisé à des fins funéraires. Il peut être situé à l'intérieur d'un cimetière.
in scheme: T96
preferred label: funerary enclosure @en-gb
preferred label: churchyard + walls @en-us
preferred label: recinto cimiteriale @it