nécropole
created: 2011-09-01T00:00:00+02:00
modified: 2014-10-15T13:17:44+02:00
status: 1
type: Concept
broad match: cb11938920h
broader: T96-160
definition: Dans l'Antiquité et durant le haut Moyen Âge, espace extra-muros destiné aux sépultures.
in scheme: T96
preferred label: cemetery 2 @en-gb
preferred label: necropolises @en-us