charnier
created: 2011-09-01T00:00:00+02:00
modified: 2014-10-15T12:59:33+02:00
status: 1
type: Concept
broad match: http://vocab.getty.edu/aat/300008027
broader: T96-164
definition: Cimetière ou partie d'un cimetière où les morts sont inhumés dans une fosse commune ou dans des tombes non individualisées.
in scheme: T96
preferred label: charnel pit @en-gb
preferred label: fossa comune @it
scope note: Ne pas confondre avec ossuaire.