columbarium
created: 2011-09-01T00:00:00+02:00
modified: 2015-02-24T15:57:32+01:00
status: 1
type: Concept
broad match: cb11938920h
broader: T96-164
definition: Ouvrage où l’on place dans des niches juxtaposées et superposées les urnes cinéraires.
in scheme: T96
preferred label: columbaria @en-us