funérarium
created: 2011-09-01T00:00:00+02:00
modified: 2014-10-15T13:01:54+02:00
status: 1
type: Concept
broader: T96-164
definition: Édifice, généralement situé près d'un cimetière, où se réunissent les familles autour des défunts lors des obsèques.
in scheme: T96
preferred label: funeral homes @en-us