lanterne des morts
created: 2011-09-01T00:00:00+02:00
modified: 2015-02-24T12:10:38+01:00
status: 1
type: Concept
broader: T96-164
definition: Édicule servant de fanal dans les cimetières.
in scheme: T96
preferred label: poor souls light @en-gb
preferred label: lanterns of the dead @en-us
preferred label: lanterna mortuaria @it
scope note: Voir aussi le Thesaurus des objets mobiliers.