mausolée
created: 2011-09-01T00:00:00+02:00
modified: 2015-02-24T16:04:20+01:00
status: 1
type: Concept
alternative label: martyrium
broader: T96-172
definition: Monument funéraire, ayant les dimensions d'un édifice, construit pour recevoir une ou plusieurs tombes. Certaines églises sont des mausolées.
in scheme: T96
preferred label: mausoleum @en-gb
preferred label: mausoleums @en-us
preferred label: mausoleo @it
scope note: Le martyrium est un mausolée élevé sur la tombe d'un martyr.