mégalithe
created: 2011-09-01T00:00:00+02:00
modified: 2015-02-24T16:05:51+01:00
status: 1
type: Concept
broader: T96-172
definition: Monument préhistorique formé de blocs de pierre de grandes dimensions. Certains de ces monuments sont enterrés sous un tumulus.
in scheme: T96
narrower: T96-176
narrower: T96-177
narrower: T96-178
narrower: T96-179
narrower: T96-180
narrower: T96-181
preferred label: standing stone 1 @en-gb
preferred label: megalithic monuments @en-us
preferred label: megalite @it