alignement
created: 2011-09-01T00:00:00+02:00
modified: 2015-02-24T16:12:10+01:00
status: 1
type: Concept
alternative label: alignement de menhir
alternative label: cromlech
broader: T96-175
definition: Ensemble formé par une rangée de menhirs. Un groupement de menhirs en cercle et, par extension, en rectangle ou en carré, est appelé cromlech.
in scheme: T96
preferred label: stone alignment @en-gb
preferred label: megalith alignments @en-us
preferred label: alineamento @it
scope note: Pour les alignements de maisons, employer : rue, ensemble d'édifices derrière façade, front bâti, etc.