dolmen
created: 2011-09-01T00:00:00+02:00
modified: 2015-02-24T16:18:20+01:00
status: 1
type: Concept
alternative label: arca
alternative label: caxa
alternative label: cibournié
broader: T96-175
definition: Chambre sépulcrale de plan massé, formée par une ou plusieurs tables portées par des orthostates. Le dolmen peut être sous tumulus.
in scheme: T96
preferred label: chambered tomb @en-gb
preferred label: megalithic chamber tomb @en-us
scope note: Ne pas confondre dolmen à couloir, dans lequel l'accès, moins large ou moins élevé que la chambre, est nettement distinct de celle-ci, avec allée couverte.