charpente de toit
created: 2011-09-01T00:00:00+02:00
modified: 2015-02-24T17:02:24+01:00
status: 1
type: Concept
alternative label: charpente d'assemblage
alternative label: charpente à la Philibert de L'Orme
broad match: http://data.bnf.fr/ark:/12148/cb11977467c
broader: T96-1257
definition: Ensemble des pièces de charpente en bois ou en fer, formant le toit, et portant le matériau de couverture.
in scheme: T96
preferred label: roof frames @en-us
scope note: Voir aussi le Thesaurus des objets mobiliers.