tombeau
terme associe: T96-136
created: 2011-09-01T00:00:00+02:00
modified: 2015-02-24T15:26:07+01:00
status: 1
type: Concept
broader: T96-172
definition: Monument funéraire élevé au-dessus d’une ou plusieurs tombes.
in scheme: T96
preferred label: tomb @en-gb
preferred label: tombs @en-us
preferred label: tomba @it
related: T96-136
scope note: Voir aussi le Thesaurus des objets mobiliers.