morgue
created: 2011-09-01T00:00:00+02:00
modified: 2015-02-24T16:27:09+01:00
status: 1
type: Concept
alternative label: institut médicolégal
broader: T96-164
definition: Édifice ou partie d’édifice où reposent les morts dans l’attente d’opérations médicolégales ou d’obsèques.
in scheme: T96
preferred label: mortuary @en-gb
preferred label: morgues @en-us
preferred label: obitorio + camera mortuaria @it