arc monumental
created: 2011-09-01T00:00:00+02:00
modified: 2015-02-24T16:33:18+01:00
status: 1
type: Concept
alternative label: arc commémoratif
alternative label: arc funéraire
broader: T96-187
definition: Monument formé d'une ou plusieurs arches. À l'époque moderne, l'arc monumental peut en outre faire fonction de porte de ville.
in scheme: T96
narrow match: Arc de triomphe
narrower: T96-189
preferred label: commemorative monument + arch @en-gb
preferred label: memorial arches @en-us
preferred label: arco onorario @it