édicule commémoratif
created: 2011-09-01T00:00:00+02:00
modified: 2013-04-23T00:00:00+02:00
status: 1
type: Concept
alternative label: mausolée urbain
broader: T96-187
definition: Édicule élevé en l’honneur d’un personnage célèbre mort, d'événements historiques majeurs, etc., placé dans un espace public.
in scheme: T96
narrower: T96-191
narrower: T96-194
preferred label: commemorative monument 2 @en-gb