obélisque
terme associe: T96-1141
created: 2011-09-01T00:00:00+02:00
modified: 2015-02-24T16:37:11+01:00
status: 1
type: Concept
alternative label: obélisque de jardin
broader: T96-187
definition: Monument en forme de pyramide élancée, habituellement terminé par un amortissement qui remplace la pointe trop fragile que formerait la rencontre des faces.
in scheme: T96
preferred label: obelisk @en-gb
preferred label: obelisks @en-us
preferred label: obelisco @it
related: T96-1141
scope note: L'obélisque se distingue de la pyramide par sa hauteur qui est supérieure à trois fois la moitié de sa base.