roche ornée
terme associe: T96-179
created: 2011-09-01T00:00:00+02:00
modified: 2015-02-24T16:38:21+01:00
status: 1
type: Concept
broader: T96-187
definition: Roche décorée par l'homme de gravures, sculptures, peintures, etc.
in scheme: T96
preferred label: rock carving + rune stone + inscribed stone @en-gb
preferred label: pitture rupestri + scultura preistorica @it
related: T96-179