trophée monumental
created: 2011-09-01T00:00:00+02:00
modified: 2014-11-18T13:04:00+01:00
status: 1
type: Concept
broader: T96-190
definition: Monument élevé en commémoration d'une victoire et portant la représentation des dépouilles des vaincus.
in scheme: T96
preferred label: trophy @en-gb
preferred label: trophies (monuments) @en-us
preferred label: trofeo @it
scope note: Voir aussi le Thesaurus des objets mobiliers.