entrepôt public
terme associe: T96-635
created: 2011-09-01T00:00:00+02:00
modified: 2014-12-05T12:19:27+01:00
status: 1
type: Concept
broad match: Entrepôt
broader: T96-198
definition: Édifice appartenant à la collectivité où sont entreposées des denrées périssables comme le sucre, le blé, le foin, etc. Dans un port, il sert d'entrepôt aux marchandises confisquées lors d'un contrôle douanier.
in scheme: T96
narrower: T96-206
related: T96-635