grenier public
created: 2011-09-01T00:00:00+02:00
modified: 2014-12-05T12:20:26+01:00
status: 1
type: Concept
broad match: http://data.bnf.fr/ark:/12148/cb11957096f
broad match: Grenier
broader: T96-205
definition: Édifice servant d'entrepôt pour les provisions de grains, constituées par une collectivité et destinées à approvisionner les marchés en cas de famine.
in scheme: T96
preferred label: granaries @en-us