banlieue
created: 2011-09-01T00:00:00+02:00
modified: 2014-10-17T14:52:57+02:00
status: 1
type: Concept
broader: T96-20
definition: Secteur urbain, plus ou moins étendu, qui entoure une ville en incluant ses faubourgs et sa périphérie, et qui dépend d'elle pour une ou plusieurs de ses fonctions.
in scheme: T96
narrow match: http://vocab.getty.edu/aat/300000874
narrower: T96-22
narrower: T96-23