faubourg
created: 2011-09-01T00:00:00+02:00
modified: 2015-01-08T10:15:47+01:00
status: 1
type: Concept
broad match: http://data.bnf.fr/ark:/12148/cb119382735
broader: T96-21
definition: À l'origine, quartier développé à l'extérieur de l'enceinte d'une ville, généralement le long d'une voie conduisant à une porte. Par extension, quartier situé à l'extérieur d'un boulevard ou au-delà d’une barrière d’octroi enserrant un centre ancien.
in scheme: T96
preferred label: suburb @en-gb
preferred label: suburbs @en-us
preferred label: sobborgo @it