ensemble d'édifices à cour commune
created: 2011-09-01T00:00:00+02:00
modified: 2015-01-08T10:25:32+01:00
status: 1
type: Concept
broader: T96-20
definition: Ensemble spontané ou concerté constitué d’édifices groupés autour d’une cour commune.
in scheme: T96