commissariat de police
created: 2011-09-01T00:00:00+02:00
modified: 2015-01-05T10:29:43+01:00
status: 1
type: Concept
alternative label: poste de police
broader: T96-242
definition: Édifice abritant les locaux des agents chargés de faire observer les règlements de police et de veiller au maintien de l'ordre et de la paix publique. Il comprend généralement un local aménagé à l'usage de cellule.
in scheme: T96
preferred label: police stations @en-us