ensemble d'édifices à desserte commune
created: 2011-09-01T00:00:00+02:00
modified: 2013-04-23T00:00:00+02:00
status: 1
type: Concept
broader: T96-20
definition: Ensemble constitué d’édifices desservis par un ou des dispositifs d’accès communs (entrée, cour, escalier, etc.).
in scheme: T96