ensemble fiscal ou financier
created: 2011-09-01T00:00:00+02:00
modified: 2013-04-23T00:00:00+02:00
status: 1
type: Concept
broader: T96-254
definition: Complexe regroupant des constructions dévolues aux activités fiscales ou financières.
in scheme: T96
narrower: T96-256