ensemble d'édifices derrière façade
created: 2011-09-01T00:00:00+02:00
modified: 2015-01-08T10:28:54+01:00
status: 1
type: Concept
broader: T96-20
definition: Ensemble concerté constitué d’édifices, de formes diverses, unifiés par une façade commune.
in scheme: T96
scope note: Ne pas confondre avec immeuble à logements.