hôtel des monnaies
created: 2011-09-01T00:00:00+02:00
modified: 2015-01-02T10:57:35+01:00
status: 1
type: Concept
broader: T96-257
definition: Établissement où l'on frappe les monnaies et les médailles.
in scheme: T96
preferred label: mints (buildings) @en-us