mont-de-piété
terme associe: T96-273
created: 2011-09-01T00:00:00+02:00
modified: 2015-01-02T11:00:51+01:00
status: 1
type: Concept
alternative label: crédit municipal
broader: T96-257
definition: Établissement de bienfaisance public, généralement communal, où les personnes nécessiteuses peuvent recevoir un prêt en contrepartie de la mise en gage d'objets mobiliers, de valeurs mobilières ou de la cession, pendant quelques mois, d'une fraction de leur salaire ou de leur pension.
in scheme: T96
preferred label: pawnshops @en-us
related: T96-273