bureau de douane
created: 2011-09-01T00:00:00+02:00
modified: 2015-01-02T11:04:43+01:00
status: 1
type: Concept
alternative label: douane
alternative label: hôtel des douanes
broader: T96-263
definition: Édifice où est établie l'administration des douanes chargée du recouvrement des droits imposés sur les marchandises, à la sortie ou à l'entrée d'un territoire national.
in scheme: T96
preferred label: customhouses @en-us