grange aux dîmes
terme associe: T96-582
created: 2011-09-01T00:00:00+02:00
modified: 2015-01-02T11:06:00+01:00
status: 1
type: Concept
broader: T96-263
definition: Grange dans laquelle est entreposé le produit des dîmes, reçu en nature (grains, foins, etc.).
in scheme: T96
preferred label: tithe barns @en-us
related: T96-582