maison aux dîmes
created: 2011-09-01T00:00:00+02:00
modified: 2015-01-02T11:10:14+01:00
status: 1
type: Concept
broader: T96-263
definition: En ville, édifice dans lequel est entreposé le produit des dîmes, en argent ou en nature.
in scheme: T96