front bâti
created: 2011-09-01T00:00:00+02:00
modified: 2015-01-08T10:34:31+01:00
status: 1
type: Concept
alternative label: front de mer
broader: T96-20
definition: Ensemble urbain formé de bâtiments, au même alignement et de gabarits voisins, formant une façade plus ou moins continue ; il est souvent disposé face à un espace libre et accompagné d'une promenade.
in scheme: T96
narrow match: http://vocab.getty.edu/aat/300008340
preferred label: waterfronts @en-us