ensemble hospitalier d'assistance ou de protection sociale
created: 2011-09-01T00:00:00+02:00
modified: 2013-04-23T00:00:00+02:00
status: 1
type: Concept
broader: T96-269
definition: Complexe regroupant des constructions consacrées aux activités hospitalières, d'assistance ou de protection sociale.
in scheme: T96
narrower: T96-271