îlot
created: 2011-09-01T00:00:00+02:00
modified: 2015-01-08T10:36:54+01:00
status: 1
type: Concept
broader: T96-20
definition: Secteur urbain délimité en continu à son pourtour par des rues ou des obstacles naturels (cours d'eau, falaise, etc.).
in scheme: T96
preferred label: city blocks @en-us
preferred label: isolato @it