établissement médical
created: 2011-09-01T00:00:00+02:00
modified: 2015-01-02T11:57:19+01:00
status: 1
type: Concept
alternative label: centre médical
alternative label: institut médical
broader: T96-288
definition: Centre de consultation et de soins médicaux.
in scheme: T96
narrower: T96-290
narrower: T96-291
preferred label: health facilities @en-us