hôpital marin
created: 2011-09-01T00:00:00+02:00
modified: 2015-01-02T12:03:04+01:00
status: 1
type: Concept
broader: T96-294
definition: Établissement situé en bord de mer destiné à accueillir des personnes, et plus particulièrement des enfants, atteintes de scrofule, de lymphatisme, d'anémie ou de rachitisme pour les faire bénéficier de bains de mer et de cures d'air et de soleil.
in scheme: T96