maternité
created: 2011-09-01T00:00:00+02:00
modified: 2015-01-02T12:16:46+01:00
status: 1
type: Concept
broader: T96-292
definition: Établissement hospitalier destiné aux femmes en couches.
in scheme: T96
preferred label: maternity hospitals @en-us