amphithéâtre d'anatomie
created: 2011-09-01T00:00:00+02:00
modified: 2015-01-02T12:29:46+01:00
status: 1
type: Concept
broader: T96-301
definition: Salle ou corps de bâtiment de plan centré - généralement circulaire ou octogonal - muni intérieurement de gradins et destiné à montrer à un public d'étudiants une dissection de cadavre exécutée sur une table placée au centre.
in scheme: T96