quartier d'aliénés
terme associe: T96-293
created: 2011-09-01T00:00:00+02:00
modified: 2015-01-02T12:35:11+01:00
status: 1
type: Concept
broader: T96-301
definition: Partie d'un hôpital ou d'un hospice, nettement séparée des corps de bâtiment principaux, accueillant exclusivement les malades mentaux et généralement constituée de bâtiments bas distribués autour de cours fermées.
in scheme: T96
related: T96-293