salle d'opération
created: 2011-09-01T00:00:00+02:00
modified: 2014-10-14T15:37:13+02:00
status: 1
type: Concept
broader: T96-301
definition: Local destiné à l'exécution des grandes opérations chirurgicales, comportant en son centre une table articulée sur laquelle est installé l'opéré, et dont les dispositions permettent d'en assurer la stérilité, tout en y prodiguant un éclairage optimal : paroi ou couverture vitrée avant l'ère de l'électricité, puis éclairage à lumières mutilples.
in scheme: T96
preferred label: operating rooms @en-us