campus universitaire
terme associe: T96-29
terme associe: T96-333
terme associe: T96-506
created: 2011-09-01T00:00:00+02:00
modified: 2014-10-16T10:33:27+02:00
status: 1
type: Concept
alternative label: campus
broader: T96-308
definition: Complexe d’enseignement supérieur, généralement planifié, réunissant les édifices d’enseignement, de logement, de restauration, de loisir, de sport, etc., utiles à la vie des étudiants.
in scheme: T96
preferred label: Campuses @en-us
related: T96-29
related: T96-333
related: T96-506