édifice scolaire
created: 2011-09-01T00:00:00+02:00
modified: 2014-12-01T15:26:22+01:00
status: 1
type: Concept
alternative label: édifice d'enseignement
broader: T96-307
definition: Construction ou groupe de constructions abritant des activités scolaires, principalement les activités d'enseignement.
in scheme: T96
narrower: T96-311
narrower: T96-329