école
created: 2011-09-01T00:00:00+02:00
modified: 2014-12-01T15:31:21+01:00
status: 1
type: Concept
broader: T96-310
definition: Établissement dans lequel est dispensé un enseignement collectif, général ou spécialisé.
in scheme: T96
narrower: T96-312
narrower: T96-313
narrower: T96-314
narrower: T96-318
narrower: T96-324
narrower: T96-325
narrower: T96-326
narrower: T96-327
narrower: T96-328