école primaire
created: 2011-09-01T00:00:00+02:00
modified: 2014-12-01T15:50:17+01:00
status: 1
type: Concept
broader: T96-311
definition: Établissement d'enseignement du premier degré, destiné aux enfants du cours préparatoire au cours moyen. Il réunit généralement des salles de classe, d'activités sportives et artistiques, etc. Autrefois, il pouvait être divisé en deux sections, réparties selon un plan symétrique : celle des filles et celle des garçons.
in scheme: T96
preferred label: elementary schools @en-us