collège
created: 2011-09-01T00:00:00+02:00
modified: 2014-12-01T16:25:13+01:00
status: 1
type: Concept
broader: T96-314
definition: Établissement public ou privé d'enseignement. Sous l'Ancien Régime, il dépendait souvent d'une institution religieuse. À partir du XIXe siècle, il désigne fréquemment un établissement d'enseignement du premier cycle.
in scheme: T96
preferred label: junior high schools @en-us