lycée
created: 2011-09-01T00:00:00+02:00
modified: 2014-12-01T16:27:30+01:00
status: 1
type: Concept
broader: T96-314
definition: Établissement d'enseignement général ou technique, dispensant l'enseignement du second cycle.
in scheme: T96
preferred label: high schools @en-us