école militaire
terme associe: T96-459
created: 2011-09-01T00:00:00+02:00
modified: 2014-12-01T16:08:16+01:00
status: 1
type: Concept
broader: T96-318
definition: École professionnelle préparant aux carrières militaires.
in scheme: T96
preferred label: military academies @en-us
related: T96-459