pensionnat
created: 2011-09-01T00:00:00+02:00
modified: 2014-12-08T11:12:23+01:00
status: 1
type: Concept
broader: T96-311
definition: École ou maison d'éducation privée, destinée à des élèves pensionnaires.
in scheme: T96
preferred label: boarding schools @en-us
scope note: Ne pas confondre avec internat.