séminaire
created: 2011-09-01T00:00:00+02:00
modified: 2014-12-01T17:06:42+01:00
status: 1
type: Concept
broader: T96-311
definition: Établissement religieux où étudient et se préparent les jeunes clercs qui doivent recevoir les ordres.
in scheme: T96
preferred label: theological seminaries @en-us